{"text_format":"1","workbook":"xlsx","n_sheets":9,"sheets":["Step1 - Overview","Step2 - Clinical Trial Info.","Step3 - Per Patient Budget","Step4 - Additional Itemised","Step5 - Pharmacy","Step6 - Setup and Other Costs","Step7 - Summary","Item Lists ","IHPA Standard Costs"],"not_rendered":{"charts":0,"images":11,"macros":1,"external_links":0,"defined_names":4,"comments":0,"pivot_tables":0},"unopened":[],"bounds":{"document_bytes":16777216,"sheet_cells":100000,"rows_first":2000,"rows_last":500,"rows_between":2000,"halvings":0,"cell_chars":16384,"cell_head_chars":4096},"cells_cut":0,"cells_raw":0,"read":"whole","date_system":"1900"}

{"sheet":"Step1 - Overview","index":0,"n_rows":124,"n_cols":5,"rows_kept":124,"cut":false,"hidden":false,"merged":[[107,0,107,15],[103,0,103,15],[24,1,24,15],[25,1,25,15],[111,0,111,12],[66,0,66,15],[67,0,67,15],[68,0,68,15],[69,0,69,15],[70,0,70,15],[71,0,71,15],[72,0,72,15],[73,0,73,15],[74,0,74,15],[75,0,75,15],[76,0,76,15],[105,0,105,15],[55,0,55,15],[56,0,56,15],[59,0,59,10],[58,0,58,12],[83,0,83,12],[81,0,81,15],[60,0,60,7],[64,0,64,15],[109,0,109,15],[77,0,77,15],[102,0,102,15],[104,0,104,12],[97,0,97,15],[89,0,89,15],[88,0,88,15],[92,0,92,15],[95,0,95,15],[78,0,78,15],[93,0,93,12],[101,0,101,15],[98,0,98,15],[96,0,96,15],[106,0,106,15],[87,0,87,15],[0,0,3,2],[2,4,2,8],[3,4,3,7],[52,0,52,15],[6,0,6,13],[9,0,9,15],[10,0,10,7],[50,0,50,15],[45,0,45,15],[38,0,38,15],[46,0,46,15],[12,0,12,15],[14,0,14,15],[22,0,22,15],[19,0,19,15],[113,0,113,15],[120,0,120,15],[20,0,20,15],[48,0,48,15],[5,0,5,15],[80,0,80,15],[86,0,86,15],[100,0,100,15],[57,0,57,10],[57,11,57,15],[62,0,62,15],[54,0,54,15],[110,0,110,15],[63,0,63,15],[82,0,82,12],[65,0,65,15]]}
[]
[null,null,null,null,"NSW DEPARTMENT OF HEALTH"]
[null,null,null,null,"NSW Budget Costing Tool "]
[null,null,null,null,"Version 1.09 (February 2018)"]
[]
["Important Information"]
["Use of this form is not mandatory but can be used to accurately cost a research project for budgetary purposes. \nThis budget can then be used to: \n(a) negotiate funding  \n(b) complete the Research GovernanceService (RGS) Budget Form."]
["Enquiries should be directed to your local Research office."]
[]
["Note: This form references standard rates for clinical trials from the Independent Hospital Pricing Authority (IHPA) Determination of standard costs associated with clinical trials in Australia 2015, details are documented in the IHPA Standard Costs sheet and  can be located at:"]
{"$rows_left_out":115}
{"sheet":"Step2 - Clinical Trial Info.","index":1,"n_rows":35,"n_cols":16,"rows_kept":35,"cut":false,"hidden":false,"merged":[[27,3,27,5],[27,6,27,8],[30,3,30,5],[30,6,30,8],[28,3,28,5],[28,6,28,8],[29,3,29,5],[29,6,29,8],[25,9,25,11],[26,3,26,5],[26,6,26,8],[9,3,9,11],[10,3,10,11],[11,3,11,11],[12,3,12,11],[13,3,13,11],[20,1,20,7],[20,9,20,13],[22,1,22,7],[22,9,22,13],[23,10,23,13],[2,1,2,13],[16,1,16,7],[16,9,16,13],[18,1,18,7],[18,9,18,13],[4,2,4,11],[5,3,5,11],[6,3,6,11],[7,3,7,11],[8,3,8,11]]}
["Clinical Trial Information/Overview"]
[]
[null,"Please complete below the relevant study information on this tab. The Industry Costing Template will use the information provided in its calculations. Additionally, the sections below will help indicate which sections of this Template that will need to be completed in order to capture the costs associate with your intended study design."]
[]
[null,"Study Title:"]
[null,"Protocol Number:"]
[null,"Department/Site:"]
[null,"Research Coordinator:"]
[null,"Principal Investigator: "]
[null,"Sponsor:"]
{"$rows_left_out":26}
{"sheet":"Step3 - Per Patient Budget","index":2,"n_rows":226,"n_cols":38,"rows_kept":226,"cut":false,"hidden":false,"merged":[[68,12,68,13],[69,6,69,7],[69,10,69,11],[69,12,69,13],[72,6,72,7],[70,6,70,7],[70,10,70,11],[70,12,70,13],[71,6,71,7],[71,10,71,11],[71,12,71,13],[72,10,72,11],[72,12,72,13],[67,6,67,13],[67,14,72,16],[2,2,2,13],[5,2,5,11],[6,24,6,25],[31,2,31,7],[57,3,57,7],[48,2,48,13],[50,6,50,7],[51,6,51,7],[52,6,52,7],[53,6,53,7],[54,6,54,7],[56,3,56,7],[68,6,68,7],[68,10,68,11]]}
[]
["Per Patient Budget"]
[null,null,"The procedures and activities below are to be documented as determined by the study protocol. Activities and study costs which cannot be reliably predicted to occur, will need to be documented on the Set-up and Other Costs section."]
[null,null,null,null,null,null,null,0,null,null,null,null,null,null,null,null,null,null,null,null,null,null,null,{"$f":"(SUM(K4:W4))*$H4","v":0},null,{"$f":"$X4*'Step2 - Clinical Trial Info.'!$D$35","v":0},{"$f":"SUM(X4:Z4)","v":0}]
[null,null,"Study Research Procedures and Related Activities:"]
[null,null,"Procedures are any protocol related activities, screening, assessments and monitoring frequency which may be undertaken by the Clinical Trial staff in order to deliver the protocol.\nA list of procedures can be accessed using the drop down list in the 'Procedure' field. You can customise and review this list on the Item Lists tab."]
[null,null,null,"Please add the number of minutes spent by each staff type on the procedure",null,null,null,null,null,null,"Please add number of times each activity occurs at each visit. This will most often be 1.",null,null,null,null,null,null,null,null,null,null,null,"ver_find",null,"Price adjusted for overhead fees",null,"TOTAL \nincluding all Costing Elements :"]
[null,null,"Procedures","Investigator","Resarch Nurse","Research Coordinator/ Manager","Admin Time","Calculated payment based on time and costs",null,null,"Baseline","Visit 1","Visit 2","Visit 3","Visit 4","Visit 5","Visit 6","Visit 7","Visit 8","Visit 9",null,null,"AB124 TEMPLATE COLUMN","Subtotal","Staff Indirect Costs","Overhead Fees","TOTAL Staff Price"]
[null,null,null,null,null,null,null,{"$f":"($D9*'Step2 - Clinical Trial Info.'!$P$27)+('Step3 - Per Patient Budget'!$E9*'Step2 - Clinical Trial Info.'!$P$28)+('Step3 - Per Patient Budget'!$F9*'Step2 - Clinical Trial Info.'!$P$30)+('Step3 - Per Patient Budget'!$G9*'Step2 - Clinical Trial Info.'!$P$31)","v":0},null,null,null,null,null,null,null,null,null,null,null,null,null,null,null,{"$f":"(SUM(K9:W9))*$H9","v":0},{"$f":"X9*'Step2 - Clinical Trial Info.'!$D$33","v":0},{"$f":"X9*'Step2 - Clinical Trial Info.'!$D$35","v":0},{"$f":"SUM(X9:Z9)","v":0}]
[null,null,null,null,null,null,null,{"$f":"($D10*'Step2 - Clinical Trial Info.'!$P$27)+('Step3 - Per Patient Budget'!$E10*'Step2 - Clinical Trial Info.'!$P$28)+('Step3 - Per Patient Budget'!$F10*'Step2 - Clinical Trial Info.'!$P$30)+('Step3 - Per Patient Budget'!$G10*'Step2 - Clinical Trial Info.'!$P$31)","v":0},null,null,null,null,null,null,null,null,null,null,null,null,null,null,null,{"$f":"(SUM(K10:W10))*$H10","v":0},{"$f":"X10*'Step2 - Clinical Trial Info.'!$D$33","v":0},{"$f":"X10*'Step2 - Clinical Trial Info.'!$D$35","v":0},{"$f":"SUM(X10:Z10)","v":0}]
{"$rows_left_out":217}
{"sheet":"Step4 - Additional Itemised","index":3,"n_rows":212,"n_cols":22,"rows_kept":212,"cut":false,"hidden":false,"merged":[[4,9,4,10],[44,4,44,7],[45,4,45,7],[4,2,4,3],[1,2,1,13],[3,2,3,7],[4,4,4,5]]}
["Additional Itemised Activities"]
[null,null,"Please document all additional activities. The procedures and activities below are events which cannot be reliably predicted or will vary through the course of the study depending on study design  or disease progression. These activities should be costed separately for  inclusion in the financial section of the Clinical Trial Agreement"]
[null,null,"Study Research Procedures, Investigations and Related Activities:",null,null,null,null,null,"PROCEDURE"]
[null,null,"Procedures are any protocol related activities, screening (including screening failures) or assessments to be undertaken by a member of the research team. Investigations are the labs, tests, scans, sampling and other diagnostic and investigative procedures offered by service support departments. \n\nThe 'Item Lists' tab lists a range of Procedures and Investigations that may be used for your study (this list can also be customised with your own items).",null,null,null,null,null,"INVESTIGATION"]
[null,null,"Select category for each item: Procedure or Investigation",null,"Enter time in minutes",null,null,null,null,"Price adjusted for costing elements",null,"TOTAL \nincluding all Costing Template Elements :",null,null,null,"Procedure"]
[null,null,"Procedures or Investigations","Study Activity","Investigator Time","Research Nurse Time","Research Coordinator/ Manager Time","Admin Time","Price","Staff Indirect Costs","Overhead Fees","TOTAL Price",null,null,null,"Investigation"]
[null,null,null,null,null,null,null,null,{"$f":"(E7*'Step2 - Clinical Trial Info.'!$P$27)+('Step4 - Additional Itemised'!F7*'Step2 - Clinical Trial Info.'!$P$28)+('Step4 - Additional Itemised'!G7*'Step2 - Clinical Trial Info.'!$P$30)+('Step4 - Additional Itemised'!H7*'Step2 - Clinical Trial Info.'!$P$31)","v":0},{"$f":"IF(C7=\"PROCEDURE\",I7*'Step2 - Clinical Trial Info.'!$D$33,0)","v":0},{"$f":"I7*'Step2 - Clinical Trial Info.'!$D$35","v":0},{"$f":"SUM(I7:K7)","v":0}]
[null,null,null,null,null,null,null,null,{"$f":"(E8*'Step2 - Clinical Trial Info.'!$P$27)+('Step4 - Additional Itemised'!F8*'Step2 - Clinical Trial Info.'!$P$28)+('Step4 - Additional Itemised'!G8*'Step2 - Clinical Trial Info.'!$P$30)+('Step4 - Additional Itemised'!H8*'Step2 - Clinical Trial Info.'!$P$31)","v":0},{"$f":"IF(C8=\"PROCEDURE\",I8*'Step2 - Clinical Trial Info.'!$D$33,0)","v":0},{"$f":"I8*'Step2 - Clinical Trial Info.'!$D$35","v":0},0]
[null,null,null,null,null,null,null,null,{"$f":"(E9*'Step2 - Clinical Trial Info.'!$P$27)+('Step4 - Additional Itemised'!F9*'Step2 - Clinical Trial Info.'!$P$28)+('Step4 - Additional Itemised'!G9*'Step2 - Clinical Trial Info.'!$P$30)+('Step4 - Additional Itemised'!H9*'Step2 - Clinical Trial Info.'!$P$31)","v":0},{"$f":"IF(C9=\"PROCEDURE\",I9*'Step2 - Clinical Trial Info.'!$D$33,0)","v":0},{"$f":"I9*'Step2 - Clinical Trial Info.'!$D$35","v":0},0]
[null,null,null,null,null,null,null,null,{"$f":"(E10*'Step2 - Clinical Trial Info.'!$P$27)+('Step4 - Additional Itemised'!F10*'Step2 - Clinical Trial Info.'!$P$28)+('Step4 - Additional Itemised'!G10*'Step2 - Clinical Trial Info.'!$P$30)+('Step4 - Additional Itemised'!H10*'Step2 - Clinical Trial Info.'!$P$31)","v":0},{"$f":"IF(C10=\"PROCEDURE\",I10*'Step2 - Clinical Trial Info.'!$D$33,0)","v":0},{"$f":"I10*'Step2 - Clinical Trial Info.'!$D$35","v":0},0]
{"$rows_left_out":203}
{"sheet":"Step5 - Pharmacy","index":4,"n_rows":76,"n_cols":19,"rows_kept":76,"cut":false,"hidden":false,"merged":[]}
["Pharmacy Services"]
[]
["Set-up, management and close-down costs (per Study)",null,"YES (value agreed)","NO (not needed)"]
["Task","Pharmacy Time (mins)","Calculated payment based on time taken","Units required",null,null,null,null,null,null,null,null,null,null,"Subtotal","Staff Indirect Costs","Overhead Fees","TOTAL Price"]
[null,null,{"$f":"(B5)*'Step2 - Clinical Trial Info.'!$P$29","v":0},null,null,null,null,null,null,null,null,null,null,null,{"$f":"D5*C5","v":0},{"$f":"$O5*'Step2 - Clinical Trial Info.'!$D$33","v":0},{"$f":"$O5*'Step2 - Clinical Trial Info.'!$D$35","v":0},{"$f":"SUM(O5:Q5)","v":0}]
[null,null,{"$f":"(B6)*'Step2 - Clinical Trial Info.'!$P$29","v":0},null,null,null,null,null,null,null,null,null,null,null,{"$f":"D6*C6","v":0},{"$f":"$O6*'Step2 - Clinical Trial Info.'!$D$33","v":0},{"$f":"$O6*'Step2 - Clinical Trial Info.'!$D$35","v":0},0]
[null,null,{"$f":"(B7)*'Step2 - Clinical Trial Info.'!$P$29","v":0},null,null,null,null,null,null,null,null,null,null,null,0,{"$f":"$O7*'Step2 - Clinical Trial Info.'!$D$33","v":0},{"$f":"$O7*'Step2 - Clinical Trial Info.'!$D$35","v":0},0]
[null,null,{"$f":"(B8)*'Step2 - Clinical Trial Info.'!$P$29","v":0},null,null,null,null,null,null,null,null,null,null,null,{"$f":"D8*C8","v":0},{"$f":"$O8*'Step2 - Clinical Trial Info.'!$D$33","v":0},{"$f":"$O8*'Step2 - Clinical Trial Info.'!$D$35","v":0},0]
[null,null,{"$f":"(B9)*'Step2 - Clinical Trial Info.'!$P$29","v":0},null,null,null,null,null,null,null,null,null,null,null,{"$f":"D9*C9","v":0},{"$f":"$O9*'Step2 - Clinical Trial Info.'!$D$33","v":0},{"$f":"$O9*'Step2 - Clinical Trial Info.'!$D$35","v":0},0]
[null,null,{"$f":"(B10)*'Step2 - Clinical Trial Info.'!$P$29","v":0},null,null,null,null,null,null,null,null,null,null,null,{"$f":"D10*C10","v":0},{"$f":"$O10*'Step2 - Clinical Trial Info.'!$D$33","v":0},{"$f":"$O10*'Step2 - Clinical Trial Info.'!$D$35","v":0},0]
{"$rows_left_out":67}
{"sheet":"Step6 - Setup and Other Costs","index":5,"n_rows":39,"n_cols":7,"rows_kept":39,"cut":false,"hidden":false,"merged":[[2,2,2,6]]}
["Set-up and other costs"]
[null,null,null,null,null,null,{"$f":"D2*E2*F2","v":0}]
[null,null,"Set-up costs may vary between Lead Sites and Non-Lead Sites. A list of Set-up, Management and Close Down tasks can be accessed using the drop down list in the 'Task' field. You can customise and review this list on the Item Lists tab."]
[null,null,"Set-up, management and close-down costs (per Study)"]
[null,null,"Task","Price",null,null,"TOTAL Price"]
[null,null,null,null,null,null,{"$f":"D6","v":0}]
[null,null,null,null,null,null,{"$f":"D7","v":0}]
[null,null,null,null,null,null,0]
[null,null,null,null,null,null,0]
[null,null,null,null,null,null,0]
{"$rows_left_out":30}
{"sheet":"Step7 - Summary","index":6,"n_rows":36,"n_cols":8,"rows_kept":36,"cut":false,"hidden":false,"merged":[[35,5,35,6],[2,10,2,11],[20,2,20,7],[2,4,2,7],[21,2,21,7],[31,1,31,4],[4,4,4,5]]}
["Clinical Trial Budget Summary"]
[null,null,null,"Study information"]
[null,null,null,"Study Title/Acronym:",{"$f":"'Step2 - Clinical Trial Info.'!$C$5","v":0}]
[]
[null,null,null,"Estimated Start Date:",{"$f":"'Step2 - Clinical Trial Info.'!$D$13","v":"00:00:00"},null,"Estimated End Date:",{"$f":"'Step2 - Clinical Trial Info.'!$D$14","v":"00:00:00"}]
[]
[null,null,null,"Number of patients/participants to be recruited:",{"$f":"'Step2 - Clinical Trial Info.'!$I$17","v":0}]
[]
[null,null,null,"Summary Budget for :",{"$f":"'Step2 - Clinical Trial Info.'!D7","v":0}]
[]
{"$rows_left_out":27}
{"sheet":"Item Lists ","index":7,"n_rows":169,"n_cols":5,"rows_kept":169,"cut":false,"hidden":false,"merged":[[3,1,3,8],[59,1,59,8],[123,1,123,8]]}
[null,"Item Lists  - Procedures/ Investigations/ Set-up, Management and Close Down Lists"]
[]
[null,"Standard Procedure List"]
[null,"The procedures listed below will appear for use in the Step3 - Per Patient Budget form.PLEASE NOTE:  you must use the INSERT NEW PROCEDURE button to ensure that the procedure is available for use on the Step3 - Per Patient Budget form."]
[null,"Procedures"]
[null,"Administer study drug in clinic"]
[null,"Allied health services"]
[null,"Biospecimen collection and processing (central labs) – performed by CTMC",null,null,"(Scroll down to see Investigations & Set-Up, Management and Close-Down Cost Lists)"]
[null,"Biospecimen collection and processing (central labs) – performed by research nurse"]
[null,"Blood sample - collection only "]
{"$rows_left_out":160}
{"sheet":"IHPA Standard Costs","index":8,"n_rows":78,"n_cols":10,"rows_kept":78,"cut":false,"hidden":false,"merged":[[9,1,10,1],[9,3,9,7],[10,3,10,7],[11,1,12,1],[2,3,2,7],[3,1,3,2],[3,3,3,7],[4,1,8,1],[4,3,4,7],[5,3,5,7],[6,3,6,7],[7,3,7,7],[8,3,8,7],[11,3,11,7],[12,3,12,7],[13,1,13,2],[13,3,13,7],[14,1,19,1],[14,3,14,7],[15,3,15,7],[16,3,16,7],[17,3,17,7],[18,3,18,7],[19,3,19,7],[20,1,21,1],[20,3,20,7],[21,3,21,7],[22,1,30,1],[22,3,22,7],[23,3,23,7],[24,3,24,7],[25,3,25,7],[26,3,26,7],[27,3,27,7],[28,3,28,7],[29,3,29,7],[30,3,30,7],[31,1,38,1],[31,3,31,7],[32,3,32,7],[33,3,33,7],[34,3,34,7],[35,3,35,7],[36,3,36,7],[37,3,37,7],[38,3,38,7],[39,1,42,1],[39,3,39,7],[40,3,40,7],[41,3,41,7],[42,3,42,7],[43,1,52,1],[43,3,43,7],[44,3,44,7],[45,3,45,7],[46,3,46,7],[49,3,49,7],[50,3,50,7],[51,3,51,7],[52,3,52,7],[47,3,47,7],[48,3,48,7],[53,1,60,1],[53,3,53,7],[54,3,54,7],[55,3,55,7],[56,3,56,7],[57,3,57,7],[58,3,58,7],[59,3,59,7],[60,3,60,7],[61,1,64,1],[61,3,61,7],[62,3,62,7],[63,3,63,7],[64,3,64,7],[76,3,76,7],[77,3,77,7],[69,3,69,7],[70,3,70,7],[71,1,71,2],[71,3,71,7],[72,3,72,7],[73,1,75,1],[73,3,73,7],[75,3,75,7],[65,1,70,1],[65,3,65,7],[66,3,66,7],[67,3,67,7],[68,3,68,7]]}
["Independent Hospital Pricing Authority (IHPA) Determination of standard costs associated with clinical trials in Australia 2015 "]
[]
["Reference Number \n","Major category","Service/Support Item ","Guidance Text ",null,null,null,null,"Recommended Standard Cost","Comments to guide use of the standard cost"]
[null,"Sub-List 1 – SITE AUTHORISATION"]
["1.1.1","Feasibility Assessment","Preliminary assessment","The activities associated with the exchange of the required reciprocal confidentiality agreements and preliminary review of a clinical trial protocol by the potential site PI (and/or delegates) . May also include initial discussions (by telephone or site visit) with the trial sponsor and/or representative.",null,null,null,null,"$60.38 per potential clinical trial","Based on the assumption that the PI and CTM/C are the only two involved in a preliminary assessment and that the hourly rate (fully absorbed) of the PI is $226.11/hour (as defined in item 2.6.1) and $90.78/hour for CTM/C (as defined in item 2.6.3).\n• Standard cost is calculated using the 25th percentile of the gathered data.\n• Potential outliers (i.e. data is suggestive although a large enough sample not available/gathered due to scope of project) were the paediatric clinical trials and Phase 1 clinical trials where the protocol is typically more detailed and requires more consideration (i.e. extra time) and hence the 25th percentile may be too low for these types of trials.\n• Although the costs are incurred by the clinical trial site the costs were not included in any clinical trial budget, as the activities occur before site selection, and are considered by Sponsors to be part of the tendering process for site selection."]
["1.1.2",null,"Protocol review","The activities associated with the heads (or nominees) within the potential clinical trial host unit (e.g. oncology, respiratory,\netc.) in addition to the supporting departments (e.g. pharmacy, pathology, radiology, radiation therapy, other clinical\nspecialties, clinical trials office/governance office, etc.) reviewing the clinical trial protocol for scientific merit and local\ninterest/feasibility. The process may involve review by individuals or by a panel drawn from representatives of the above\nmentioned departments.",null,null,null,null,"$407.67 per potential clinical trial","Based on the assumption that the PI and CTM/C are the only two involved in protocol review and that the hourly rate (fully absorbed) of the PI is $226.11/hour (as defined in item 2.6.1) and $90.78/hour for CTM/C (as defined in item 2.6.3).\n• Standard cost is calculated using the median of the gathered data.\n• Although the costs are incurred by the clinical trial site the costs were not included in any clinical trial budget, as the activities occur before site selection, and are considered by Sponsors to be part of the tendering process for site selection."]
["1.1.3.1",null,"Feasibility determination – completion of feasibility questionnaire","The activities associated with determining the feasibility and desirability of conducting the trial at a site (culminating with\nthe completion of the feasibility assessment questionnaire) covering the assessment of:\n-  whether trial is consistent with institution’s mission, research priorities and risk management profile;\n-  likelihood of being able to recruit suitable types and numbers of patients;\n-  availability of staff and other resources required to undertake the trial;\n-  the services that will be standard to care for patients on the trial and those that will be trial specific with reference to the trial protocol.\n-  acceptability of the proposed budget and contract;\n",null,null,null,null,"$294.62 for completion of feasibility questionnaire required for a potential clinical trial","Based on the assumption that the PI and CTM/C are the only two involved in protocol review and that the hourly rate (fully absorbed) of the PI is $226.11/hour (as defined in item 2.6.1) and $90.78/hour for CTM/C (as defined in item 2.6.3).\n• Standard cost is calculated using the median of the gathered data."]
["1.1.3.2",null,"Feasibility determination – study site visit","The activities may include hosting a feasibility assessment visits by the trial sponsor and/or representative.",null,null,null,null,"$675.95 for study site selection visit required by Sponsor organisation for a potential clinical trial","Based on the assumption that the PI, CTM/C and at least one supporting department (usually the pharmacy) are involved and that the hourly rate (fully absorbed) of the PI is $226.11/hour (as defined in item 2.6.1), $90.78/hour for CTM/C (as defined in item 2.6.3) and $86.72/hour (blended hourly rate, based on the assumption that the involved personnel from supporting departments is either a hospital scientist (i.e. Grade 3/4 hospital scientist) and/or pharmacist (i.e. Grade 3/5 pharmacist)).\n• Standard cost is calculated using the median of the gathered data."]
["1.1.3.3",null,"Feasibility determination – budget negotiation and contract review","Based on the assumption that the PI, CRC, RGO and at least one supporting department are involved in the budget and contract review. ",null,null,null,null,"$755.51 for budget negotiation and contract review for a potential clinical trial","Based on the assumption that the PI, CTM/C, at least one supporting department (usually the pharmacy) and personnel from the RGO are involved and that the hourly rate (fully absorbed) of the PI is $226.11/hour (as defined in item 2.6.1), $90.78/hour for CTM/C (as defined in item 2.6.3), $86.72/hour (blended hourly rate, based on the assumption that the involved personnel from supporting departments is either a hospital scientist (i.e. Grade 3/4 hospital scientist) and/or pharmacist (i.e. Grade 3/5 pharmacist)) and $70.59/hour for RGO staff based on the average salary for a research and governance officer is $82,587 plus superannuation).\n• Standard cost is calculated using the median of the gathered data.\n• Assumes that the provided Sponsors’ contract is either the standard Medicine Australia (MA), or MTAA or other pre-approved agreement and includes the use of previously agreed or standard schedules (e.g. 4 and 7). If not, legal costs are incurred by the site (i.e. services either provided by internal or outsourced lawyer). This legal cost is not included in the standard cost."]
["1.2.1","Ethics Approval","Preparation of the HREC\napplication","The activities associated with the preparation and submission of the human research ethics committee (HREC) application\nform (or equivalent) and supporting documentation which includes the protocol, participant information and consent form\n(PICF), recruitment and advertising materials, etc. Also includes revisions to applications in response to ethics committee\nrequests for additional information and forwarding copies of relevant approvals (once obtained) and associated\ndocumentation to the trial funder/sponsor.",null,null,null,null,"$2,607.83 per clinical trial (i.e. per HREC application)","Based on the assumption that the PI and CTM/C are the only two involved in a preliminary assessment and that the hourly rate (fully absorbed) of the PI is $226.11/hour (as defined in item 2.6.1) and $90.78/hour for CTM/C (as defined in item 2.6.3).\n• Standard cost is calculated using the median of the gathered data.\n• As the data represents a mix of industry sponsored trials (where drafts of required documents are provided) as well as collaborative and investigator initiated trials (where de novo applications are prepared) this accounts for the large variation from min to 75th percentile.\n• The ‘max’ value was due to the data gathered from the one paediatric site included in the study. Setting a differential standard cost for paediatric clinical trials at the 75th percentile was considered. However as only one paediatric site was included in the sample, it was considered that there was insufficient evidence to set a differential standard cost for paediatric clinical trials at this stage, even though the gathered data suggests it would reflect a more realistic cost associated with the input time for such types of clinical trials."]
{"$rows_left_out":68}